�s���{���R�[�h���͎s�撬���R�[�h,NO,�s���{����,�s�撬����,����,����_�J�i,����_�ʏ�,����_�p��,����������,���,�ꏊ����,�Z��,����,�ܓx,�o�x,�d�b�ԍ�,�����ԍ�,�����i���j,�����i�P�ʁj,�@�l�ԍ�,���L�ғ�,�������w���,���p�\�j��,�J�n����,�I������,���p�\�������L����,�摜,�摜_���C�Z���X,�T�v,�T�v_�p��,����,����_�p��,URL,���l
184233,0000000001,���䌧,�z�O��,��J����d��,�I�I�^���W�N�W���E�m�g�E,,,�d�v������,������,��J��,�O���S�z�O����J��42-4-1,,36.005641,136.09044,,,1,��,,��J��,1957-02-19,,,,,,,,,,,,
184233,0000000002,���䌧,�z�O��,���؉ƏZ��,�A�C�L�P�W���E�^�N,,,�d�v������,������,,�O���S�z�O�����]��26-44,,35.929177,136.067125,,,1,��,,�l,1969-12-18,,,,,,,,,,,,
184233,0000000003,���䌧,�z�O��,���_�Ђ̐ێАD�c�_��,�c���M�W���W���m�Z�b�V���I�^�W���W��,,,���w��L�`������,������,���_��,�O���S�z�O���D�c113-1,,35.957835,136.055383,,,1,��,,���_��,1971-04-16,,,,,,,,,,,,
184233,0000000004,���䌧,�z�O��,���_�Ж{�a,�c���M�W���W���z���f��,,,���w��L�`������,������,���_��,�O���S�z�O���D�c113-1,,35.957835,136.055383,,,1,��,,���_��,1979-02-06,,,,,,,,,,,,
184233,0000000005,���䌧,�z�O��,����,�{���V���E,,,����,���p�H�|�i,�D�c�������j��,�O���S�z�O���D�c153-1-8,,35.95900 ,136.05502,,,1,��,,���_��,1956-06-28,,,,,,,,,,,,
184233,0000000006,���䌧,�z�O��,�������ϐ},�n�b�\�E�l�n���Y,,,�d�v������,���p�H�|�i,�ޗǍ���������,�ޗǌ��ޗǎs�o��H��50,,34.68330 ,135.83833,,,1,��,,���_��,1956-06-28,,,,,,,,,,,,
184233,0000000007,���䌧,�z�O��,�ؑ��@����ɔ@�������A�ؑ��@����ɔ@�������A�ؑ��@�߉ޔ@�������A�ؑ��@��F�`����(���@�ؑ����w),���N�]�E�@�A�~�_�j�����C�U�]�E�A���N�]�E�@�A�~�_�j�����C�U�]�E�A���N�]�E�@�V���J�j�����C�U�]�E�A���N�]�E�{�T�c�M���E�U�]�E�i�c�P�^���@���N�]�E�R�E�n�C�j,,,�d�v������,���p�H�|�i,����_��,�O���S�z�O���V��18-24,,35.98350 ,136.12331,,,4,��,,����_��,1973-06-06,,,,,,,,,,,,
184233,0000000008,���䌧,�z�O��,�����@�������,�~�b�L���E�z�E�O�R���h�E�o��,,,���w��L�`������,���p�H�|�i,�D�c�������j��,�O���S�z�O���D�c153-1-8,,35.95900 ,136.05502,,,1,��,,���_��,1971-04-16,,,,,,,,,,,,
184233,0000000009,���䌧,�z�O��,���{���F�@�s�������O����,�V�z���`���N�V���N�@�t�h�E�~���E�I�E�T���]���]�E,,,���w��L�`������,���p�H�|�i,�D�c�������j��,�O���S�z�O���D�c153-1-8,,35.95900 ,136.05502,,,3,��,,���_��,1984-03-02,,,,,,,,,,,,
184233,0000000010,���䌧,�z�O��,���@�Ł@��،o,�I�E�o�N�o���@�C�b�T�C�L���E,,,���w��L�`������,���p�H�|�i,�򏟎�,�O���S�z�O��������101-�P,,36.20305,136.06858,,,"1,521",��,,�򏟎�,1984-03-02,,,,,,,,,,,,
184233,0000000011,���䌧,�z�O��,�z�m�_�Е���,�I�`�W���W�������W��,,,���w��L�`������,���p�H�|�i,���䌧������,����s���n��51-11,,36.03728,136.24222,,,151,�_,,�z�m�_��,2013-03-22,,,,,,,,,,,,
184233,0000000012,���䌧,�z�O��,���_�Е���,�c���M�W���W�������W��,,,���w��L�`������,���p�H�|�i,�D�c�������j��,�O���S�z�O���D�c153-1-8,,35.95900 ,136.05502,,,210,�_,,���_��,2013-03-22,,,,,,,,,,,,
184233,0000000013,���䌧,�z�O��,�ؑ��@����@������,���N�]�E�@�_�C�j�`�j�����C�U�]�E,,,���w��L�`������,���p�H�|�i,���g�_��,�O���S�z�O�����S�X-55,,35.97584,136.12650 ,,,1,��,,���g�_��,1954-12-03,,,,,,,,,,,,
184233,0000000014,���䌧,�z�O��,�ؑ��@���ω���F����,���N�]�E�@�Z���W���J���m���{�T�c�����E�]�E,,,���w��L�`������,���p�H�|�i,���ʎ�,�O���S�z�O������7-61,,35.97125,136.12338,,,1,��,,���ʎ�,1956-03-12,,,,,,,,,,,,
184233,0000000015,���䌧,�z�O��,�ؑ��@�j�_��,���N�]�E�@�_���V���]�E,,,���w��L�`������,���p�H�|�i,���X���u�_��,�O���S�z�O�����X���R�O-�P,,35.96901,136.12485,,,1,��,,���X���u�_��,1969-04-01,,,,,,,,,,,,
184233,0000000016,���䌧,�z�O��,�ؑ��@���ω���F����,���N�]�E�@�V���E�J���m���{�T�c�����E�]�E,,,���w��L�`������,���p�H�|�i,���ʎ�,�O���S�z�O������7-61,,35.97125,136.12338,,,1,��,,���ʎ�,1984-03-02,,,,,,,,,,,,
184233,0000000017,���䌧,�z�O��,�ؑ��@�\��ʊω���F������,���N�]�E�@�W���E�C�`�����J���m���{�T�c�U�]�E�@�z�J,,,���w��L�`������,���p�H�|�i,��J��,�O���S�z�O����J��42-4-1,,36.005641,136.09044,,,11,��,,��J��,1996-05-31,,,,,,,,,,,,
184233,0000000018,���䌧,�z�O��,�ؑ��@�\��ʏ��_����,���N�]�E�@�W���E�C�`�����j���V���U�]�E,,,���w��L�`������,���p�H�|�i,����_��,�O���S�z�O���V��18-24,,35.98350 ,136.12331,,,1,��,,����_��,1999-04-23,,,,,,,,,,,,
184233,0000000019,���䌧,�z�O��,���_�΂₵,�~���E�W���o���V,,,���w�薯��������,�|�\,,�O���S�z�O���D�c113-1,,35.957835,136.055383,,,,,,���_�΂₵�ۑ���,1971-04-16,,,,,,,,,,,,
184233,0000000020,���䌧,�z�O��,���c���q��,�n�b�^�V�V�}�C,,,���w�薯��������,�|�\,,�O���S�z�O�����c,,35.921004,136.112471,,,,,,���c���q���ۑ���,1986-03-28,,,,,,,,,,,,
184233,0000000021,���䌧,�z�O��,�����R�Õ��Q,�A�T�q���}�R�t���O��,,,���w��j��,���̑�,,�O���S�z�O�������A���S,,35.971835,136.12456,,,,,,�z�O��,1956-03-12,,,,,,,,,,,,
184233,0000000022,���䌧,�z�O��,�_�����J�̐{�b��q��,�V���K�^�j�m�X�G�L�J�}�A�g,,,���w��j��,���̑�,,�O���S�z�O�����]��115,,35.925435,136.072893,,,,,,�z�O��,1966-04-26,,,,,,,,,,,,
184233,0000000023,���䌧,�z�O��,�z�m�R�R�x�M��,�I�`�T���T���K�N�V���R�E�A�g,,,���w��j��,���̑�,,�O���S�z�O����J,,36.005993,136.090368,,,,,,�z�O��,1973-05-01,,,,,,,,,,,,
184233,0000000024,���䌧,�z�O��,�z�O���|�傩�߂˂����Đ��`�Z�@,�G�`�[���g�E�Q�C�I�I�J���l�W�^�e�Z�C�P�C�M�z�E,,,���w�薳�`������,���̑�,,�O���S�z�O��,,,,,,,,,,1986-03-28,,,,,,,,,,,,���݁A�F��ێ��Җ���
184233,0000000025,���䌧,�z�O��,�z�O�×q�����ً������E�q��ƏZ��i������ƏZ��剮�j,�G�`�[���R���E�n�N�u�c�J���L���E�~�Y�m�N�E�G�����P�W���E�^�N�i�L���E�~�Y�m�P�W���E�^�N�I�����j,,,���o�^�L�`������,������,�z�O�×q������,�z�O�����]��170-1-169,,35.936330 ,136.060600 ,,,1,��,,���䌧,2018-05-10,,,,,,,,,,,,
184233,0000000026,���䌧,�z�O��,���䌧�����펑���i�����E�q��R���N�V�����j,�t�N�C�P���g�E�W�L�V�����E�i�~�Y�m�N�E�G�����R���N�V�����j,,,���o�^�L�`������,���p�H�|�i,���䌧���|�فE�z�O�×q������,�z�O�����]��120-61�E���]��170-1-169,,,,,,1642,�_,,���䌧,2010-06-29,,,,,,,,,,,,�Z������J
184233,0000000027,���䌧,�z�O��,�z�O�C�݂̐��唨�@�㖦�̕����I�i��,�G�`�[���J�C�K���m�X�C�Z���o�^�P�@�J�~�~�T�L�m�u���J�e�L�P�C�J��,,,�d�v�����I�i��,���̑�,,�z�O�����q�����E���E�E������,,,,,,,,,,,,,,,,,,,,,,
