�s���{���R�[�h���͎s�撬���R�[�h,NO,�s���{����,�s�撬����,����,����_�J�i,����_�p��,�Z��,����,�ݒu�ʒu,�ܓx,�o�x,�j���g�C������,�j���g�C�����i���֊�j,�j���g�C�����i�a���j,�j���g�C�����i�m���j,�����g�C������,�����g�C�����i�a���j,�����g�C�����i�m���j,�j�����p�g�C������,�j�����p�g�C�����i�a���j,�j�����p�g�C�����i�m���j,���@�\�g�C����,�Ԉ֎q�g�p�җp�g�C���L��,���c���p�ݔ��ݒu�g�C���L��,�I�X�g���C�g�ݒu�g�C���L��,���p�J�n����,���p�I������,���p�\���ԓ��L����,���l
184233,,���䌧,�z�O��,�����P������,�g�E�u�C�`�S�E�R�E�G��,,�z�O�������S4����501,,,35.97163,136.13273,4,3,1,,3,2,1,1,,1,,�L,,,,,24����,�ϐ᎞��
184233,,���䌧,�z�O��,�����Q������,�g�E�u�j�S�E�R�E�G��,,�z�O�����c��2����505,,,35.97563,136.13552,1,1,,,,,,1,1,,,,,,,,24����,�ϐ᎞��
184233,,���䌧,�z�O��,�Õ�����,�R�t���R�E�G��,,�z�O������,,,35.97156,136.12325,,,,,,,,,,,,,,,,,,
184233,,���䌧,�z�O��,�Õ�����,�R�t���R�E�G��,,�z�O������,,,35.97035,136.12153,,,,,,,,,,,,�L,,,,,,
184233,,���䌧,�z�O��,������������,�A�T�q�`���E�I�E�R�E�G��,,�z�O�����c��,,,35.97698,136.12887,,,,,,,,,,,,�L,,,,,,
184233,,���䌧,�z�O��,�D�c��������,�I�^�`���E�I�E�R�E�G��,,�z�O���D�c,,,35.94824,136.05623,,,,,,,,,,,,,,,,,,
184233,,���䌧,�z�O��,�D�c��������,�I�^�`���E�I�E�R�E�G��,,�z�O���D�c,,,35.94959,136.05721,,,,,,,,,,,,,,,,,,
184233,,���䌧,�z�O��,�s�V�R����,�t���E�U���R�E�G��,,�z�O���D�c,,,35.9557,136.0625,,,,,,,,,,,,,,,,,,
184233,,���䌧,�z�O��,�~�Î�������,�J�V�d�W�h�E�R�E�G��,,�z�O���~��4-10,,,35.94071,136.08732,,,,,,,,,,,,,,,,,,
184233,,���䌧,�z�O��,�]�g��������,�G�i�~�W�h�E�R�E�G��,,�z�O���]�g116-118,,,35.94389,136.07406,,,,,,,,,,,,,,,,,,
184233,,���䌧,�z�O��,�א��̓m,�^�C�`���E�m����,,�z�O�����q88-55-1,,,35.997602,136.093303,,,,,,,,,,,,,,,09:00,22:00,�x�فF��P�E�R�E�T�Ηj��,
184233,,���䌧,�z�O��,���䑍���A�����v�����g�s�A,�t�N�C�\�E�S�E�V���N�u�c�G���v�����g�s�A,,�z�O������17-3-1,,,35.968746,136.118848,,,,,,,,,,,,,,,09:00,17:00,�x�فF���T�Ηj��,
184233,,���䌧,�z�O��,�I�^�C�R�q���Y,�I�^�C�R�q���Y,,�z�O�����͌�37-19-1,,,35.948881,136.057729,,,,,,,,,,,�L,,,,09:00,,�x�فF���T���j��,
184233,,���䌧,�z�O��,�I�v���}���̓m,���E�L���E���}���m����,,�z�O������44-3,,,35.977808,136.029367,,,,,,,,,,,,,,,,,���x,
184233,,���䌧,�z�O��,�Õ�����,�R�t���R�E�G��,,�z�O�������n�W,,�K�ቑ��,35.970788,136.120774,3,2,1,,2,2,,1,,1,,�L,�L,�L,,,24����,�ϐ᎞��
184233,,���䌧,�z�O��,�Õ�����,�R�t���R�E�G��,,�z�O�������n�W,,���ʎ���,35.971699,136.123188,2,2,,,,,,2,2,,,,,,,,24����,�ϐ᎞��
184233,,���䌧,�z�O��,�z�O���c���������^����,�G�`�[���`���E�G�C�A�T�q�\�E�S�E�E���h�E�W���E,,�z�O��������42��8�Ԓn,,���ԏ�,35.971612,136.117791,6,4,,2,4,,4,,,,�L,�L,�L,�L,,,24����,�ϐ᎞��
184233,,���䌧,�z�O��,�����C�m�Z���^�[,�A�T�q�J�C���E�Z���^�[,,�z�O��������22��35�Ԓn,,�C�m�Z���^�[��,35.970362,136.118285,5,3,1,1,4,3,1,1,,1,,�L,��,��,09:00,21:45,�x�فF�Ηj���i�Ηj���j���̏ꍇ�͂��̗����j�N���N�n,
184233,,���䌧,�z�O��,�z�O���c���Z��,�G�`�[���`���E�G�C�L���E�M�W���E,,�z�O����싎��11��1�Ԓn1,,��2���ԏ�,35.969884,136.137157,3,2,1,,2,2,,1,,1,�L,�L,��,��,,,24����,�ϐ᎞��
184233,,���䌧,�z�O��,�D�c��������,�I�^�`���E�I�E�R�E�G��,,�z�O�����͌��n�W,,���C���X�^���h,35.948847,136.055712,5,3,,2,2,,2,,,,,,,,,,24����,�ϐ᎞��
184233,,���䌧,�z�O��,�D�c��������,�I�^�`���E�I�E�R�E�G��,,�z�O�����͌��n�W,,�|����,35.94816,136.056441,3,2,1,,2,2,,,,,,,,,,,24����,�ϐ᎞��
184233,,���䌧,�z�O��,�z�O���|�������𗬉��,�G�`�[���g�E�Q�C�����u���J�R�E�����E�J�C�J��,,�z�O�����]����7��8�Ԓn,,,35.933126,136.059704,15,12,2,1,13,11,2,,,,�L,�L,�L,�L,09:00,17:00,,
184233,,���䌧,�z�O��,�z�O���Ƀ~���[�W�A��,�G�`�[���K�j�~���[�W�A��,,�z�O���~��71��324�Ԓn1,,�~���[�W�A����,35.920248,135.997883,4,2,,2,3,,3,,,,�L,�L,�L,,09:00,17:00,,�v���ٗ�
184233,,���䌧,�z�O��,�z�O���Ƀ~���[�W�A��   ��������,�G�`�[���K�j�~���[�W�A���@�E�I�C�`,,�z�O���~��71��324�Ԓn1,,�}�[�P�b�g��,35.919952,135.997893,5,3,1,1,4,2,2,,,,�L,�L,�L,,09:00,17:00,,
184233,,���䌧,�z�O��,���̉w�u�z�O�v,�~�`�m�G�L�u�G�`�[���v,,�z�O���~��71��335�Ԓn1,,,35.920039,135.997271,3,2,,1,2,,2,,,1,,�L,�L,,09:00,22:00,,
184233,,���䌧,�z�O��,���̉w�u�z�O�v,�~�`�m�G�L�u�G�`�[���v,,�z�O���~��71��324�Ԓn,,�z�O���Ƀ~���[�W�A���}�[�P�b�g����,35.919327,135.997926,5,3,,2,4,,4,,,,�L,�L,�L,�L,,,24����,
184233,,���䌧,�z�O��,�z�O����I�V���C����,�G�`�[���I���Z�����e���u���C�T���r,,�z�O���~��71��335�Ԓn1,,,35.920039,135.997271,1,,1,,1,1,,,,,,,,,11:00,22:00,,�v���ٗ�
184233,,���䌧,�z�O��,�A�N�e�B�u�n�E�X�z�O,�A�N�e�B�u�n�E�X�G�`�[��,,�z�O���~��71��335�Ԓn1,,,35.920039,135.997271,17,10,5,2,12,8,4,1,,1,,�L,,,11:00,21:00,,�v���ٗ�
184233,,���䌧,�z�O��,�z�O����I�V���C���{�C,�G�`�[���I���Z�����e���u���j�z���J�C,,�z�O����ɑ�66��97�Ԓn,,,35.920039,135.997271,3,2,,1,2,,2,,,,,�L,,,07:00,21:00,,�v���ٗ�
184233,,���䌧,�z�O��,�z�O�����僉���h,�G�`�[���~�T�L�X�C�Z�������h,,�z�O���������25��2�Ԓn,,���ԏ�,35.982522,135.961489,3,2,,1,2,,2,1,,1,,�L,,,,,24����,
184233,,���䌧,�z�O��,�z�O�����僉���h,�G�`�[���~�T�L�X�C�Z�������h,,�z�O���������27��1�Ԓn2,,�K�[�f���N���u�n�E�X,35.981584,135.961575,3,2,1,,3,3,,1,,1,,�L,,,09:00,17:00,,
184233,,���䌧,�z�O��,��������O�֏�,�g���N�\�C���R�E�V���E�x���W��,,�������ޓ���(�z�O�����E),,,35.985109,135.961145,,,,,,,,,,,,�L,,,,,24����,
184233,,���䌧,�z�O��,�ʐ���O�֏�,�^�}�K���R�E�V���E�x���W��,,�ʐ�ω����ԏ�(�z�O���ʐ�),,,35.970375,135.965801,,,,,,,,,,,,,,,,,24����,
184233,,���䌧,�z�O��,�������O�֏�,�A�i�h���R�E�V���E�x���W��,,���ٖ��Ή�(�z�O���~),,,35.922974,135.997759,,,,,,,,,,,,,,,,,24����,
184233,,���䌧,�z�O��,���{�l���O�֏�,�i�K�X�n�}�R�E�V���E�x���W��,,���{�l�C�������(�z�O���~),,,35.91667,135.996846,,,,,,,,,,,,,,,,,24����,
184233,,���䌧,�z�O��,���l���O�֏�,�V���n�}�R�E�V���E�x���W��,,���l�C�����꒓�ԏ��(�z�O���Ό�),,,35.906372,135.997179,,,,,,,,,,,,,,,,,24����,
184233,,���䌧,�z�O��,�ǐΕl���O�֏�,�J�u�V�n�}�R�E�V���E�x���W��,,�ǐΕl�C�����꒓�ԏ��(�z�O�����),,,35.892832,135.995559,,,,,,,,,,,,�L,,,,,24����,
184233,,���䌧,�z�O��,���̉w�u�p�[�N�C���O�����u�v,�~�`�m�G�L�u�p�[�N�C���j���E�K�I�J�v,,�z�O����싎��45��1�Ԓn7,,,35.969374,136.119833,,,,,,,,,,,,,,,,,,
